Reaction Details
TargetCytochrome P450 1A2
LigandBDBM50237622
Substrate/Competitorn/a
Meas. Tech.ChEMBL_475133 (CHEMBL932655)
IC50>50000±n/a nM
Citation Caldwell, JJDavies, TGDonald, AMcHardy, TRowlands, MGAherne, GWHunter, LKTaylor, KRuddle, RRaynaud, FIVerdonk, MWorkman, PGarrett, MDCollins, I Identification of 4-(4-aminopiperidin-1-yl)-7H-pyrrolo[2,3-d]pyrimidines as selective inhibitors of protein kinase B through fragment elaboration. J Med Chem51:2147-57 (2008) 
 
Cytochrome P450 1A2
Name:Cytochrome P450 1A2
Type:Enzyme
Mol. Mass.:58423.38
Organism:Homo sapiens (Human)
Description:P05177
Residue:516
BDBM50237622
NameBDBM50237622
Synonyms:4-(4-Chlorobenzyl)-1-(7H-pyrrolo[2,3-d]pyrimidin-4-yl)piperidin- CCT128930 US8796293, 17
TypeSmall organic molecule
Emp. Form.C18H20ClN5
Mol. Mass.341.838
SMILESNC1(Cc2ccc(Cl)cc2)CCN(CC1)c1ncnc2[nH]ccc12