Reaction Details
TargetMitogen-activated protein kinase 8
LigandBDBM50376112
Substrate/Competitorn/a
Meas. Tech.ChEMBL_475208 (CHEMBL921936)
IC50 670±n/a nM
Citation Asano, YKitamura, SOhra, TItoh, FKajino, MTamura, TKaneko, MIkeda, SIgata, HKawamoto, TSogabe, SMatsumoto, STanaka, TYamaguchi, MKimura, HFukumoto, S Discovery, synthesis and biological evaluation of isoquinolones as novel and highly selective JNK inhibitors (2). Bioorg Med Chem16:4699-714 (2008) 
 
Mitogen-activated protein kinase 8
Name:Mitogen-activated protein kinase 8
Type:PROTEIN
Mol. Mass.:46809.57
Organism:Rattus norvegicus
Description:ChEMBL_475208
Residue:411
BDBM50376112
NameBDBM50376112
Synonyms:CHEMBL258845
TypeSmall organic molecule
Emp. Form.C25H23ClN4O3
Mol. Mass.462.928
SMILESCCC(=O)c1c(-c2ccccc2)c2cc(Cl)ccc2c(=O)n1Cc1cc(C(N)=O)n(CC)n1