Reaction Details
TargetMitogen-activated protein kinase 10
LigandBDBM50373215
Substrate/Competitorn/a
Meas. Tech.ChEMBL_475221 (CHEMBL921949)
IC50 30±n/a nM
Citation Asano, YKitamura, SOhra, TItoh, FKajino, MTamura, TKaneko, MIkeda, SIgata, HKawamoto, TSogabe, SMatsumoto, STanaka, TYamaguchi, MKimura, HFukumoto, S Discovery, synthesis and biological evaluation of isoquinolones as novel and highly selective JNK inhibitors (2). Bioorg Med Chem16:4699-714 (2008) 
 
Mitogen-activated protein kinase 10
Name:Mitogen-activated protein kinase 10
Type:Enzyme
Mol. Mass.:52586.89
Organism:Homo sapiens (Human)
Description:n/a
Residue:464
BDBM50373215
NameBDBM50373215
Synonyms:CHEMBL259060
TypeSmall organic molecule
Emp. Form.C25H20BrNO5S
Mol. Mass.526.399
SMILESCOC(=O)c1c(-c2ccccc2)c2cc(Br)ccc2c(=O)n1Cc1ccc(cc1)S(C)(=O)=O