Reaction Details
TargetRmtA
LigandBDBM50376141
Substrate/Competitorn/a
Meas. Tech.ChEMBL_475539 (CHEMBL925748)
IC50 89700±n/a nM
Citation Mai, ACheng, DBedford, MTValente, SNebbioso, APerrone, ABrosch, GSbardella, GDe Bellis, FMiceli, MAltucci, L epigenetic multiple ligands: mixed histone/protein methyltransferase, acetyltransferase, and class III deacetylase (sirtuin) inhibitors. J Med Chem51:2279-90 (2008) 
 
RmtA
Name:RmtA
Synonyms:n/a
Type:PROTEIN
Mol. Mass.:39351.26
Organism:Emericella nidulans
Description:ChEMBL_475539
Residue:345
BDBM50376141
NameBDBM50376141
Synonyms:CHEMBL261192
TypeSmall organic molecule
Emp. Form.C16H12Br4N2O4
Mol. Mass.615.893
SMILESOc1c(Br)cc(cc1Br)C(=O)NCCNC(=O)c1cc(Br)c(O)c(Br)c1