Reaction Details
TargetRmtA
LigandBDBM50376148
Substrate/Competitorn/a
Meas. Tech.ChEMBL_475539 (CHEMBL925748)
IC50 92000±n/a nM
Citation Mai, ACheng, DBedford, MTValente, SNebbioso, APerrone, ABrosch, GSbardella, GDe Bellis, FMiceli, MAltucci, L epigenetic multiple ligands: mixed histone/protein methyltransferase, acetyltransferase, and class III deacetylase (sirtuin) inhibitors. J Med Chem51:2279-90 (2008) 
 
RmtA
Name:RmtA
Synonyms:n/a
Type:PROTEIN
Mol. Mass.:39351.26
Organism:Emericella nidulans
Description:ChEMBL_475539
Residue:345
BDBM50376148
NameBDBM50376148
Synonyms:CHEMBL264668
TypeSmall organic molecule
Emp. Form.C24H16Br2O3
Mol. Mass.512.19
SMILESOc1ccc(\C=C2/Cc3ccccc3\C(=C/c3ccc(O)c(Br)c3)C2=O)cc1Br