Reaction Details
TargetRmtA
LigandBDBM50376158
Substrate/Competitorn/a
Meas. Tech.ChEMBL_475539 (CHEMBL925748)
IC50 55000±n/a nM
Citation Mai, ACheng, DBedford, MTValente, SNebbioso, APerrone, ABrosch, GSbardella, GDe Bellis, FMiceli, MAltucci, L epigenetic multiple ligands: mixed histone/protein methyltransferase, acetyltransferase, and class III deacetylase (sirtuin) inhibitors. J Med Chem51:2279-90 (2008) 
 
RmtA
Name:RmtA
Synonyms:n/a
Type:PROTEIN
Mol. Mass.:39351.26
Organism:Emericella nidulans
Description:ChEMBL_475539
Residue:345
BDBM50376158
NameBDBM50376158
Synonyms:CHEMBL258624
TypeSmall organic molecule
Emp. Form.C19H14O7
Mol. Mass.354.3103
SMILESOC(=O)c1cc(\C=C\C(=O)\C=C\c2ccc(O)c(c2)C(O)=O)ccc1O