Reaction Details
TargetRmtA
LigandBDBM50376163
Substrate/Competitorn/a
Meas. Tech.ChEMBL_475539 (CHEMBL925748)
IC50 156400±n/a nM
Citation Mai, ACheng, DBedford, MTValente, SNebbioso, APerrone, ABrosch, GSbardella, GDe Bellis, FMiceli, MAltucci, L epigenetic multiple ligands: mixed histone/protein methyltransferase, acetyltransferase, and class III deacetylase (sirtuin) inhibitors. J Med Chem51:2279-90 (2008) 
 
RmtA
Name:RmtA
Synonyms:n/a
Type:PROTEIN
Mol. Mass.:39351.26
Organism:Emericella nidulans
Description:ChEMBL_475539
Residue:345
BDBM50376163
NameBDBM50376163
Synonyms:CHEMBL259577
TypeSmall organic molecule
Emp. Form.C21H16Br4O4
Mol. Mass.651.965
SMILESCC(C)(C(=O)\C=C\c1cc(Br)c(O)c(Br)c1)C(=O)\C=C\c1cc(Br)c(O)c(Br)c1