Reaction Details
TargetRmtA
LigandBDBM50376168
Substrate/Competitorn/a
Meas. Tech.ChEMBL_475539 (CHEMBL925748)
IC50 18000±n/a nM
Citation Mai, ACheng, DBedford, MTValente, SNebbioso, APerrone, ABrosch, GSbardella, GDe Bellis, FMiceli, MAltucci, L epigenetic multiple ligands: mixed histone/protein methyltransferase, acetyltransferase, and class III deacetylase (sirtuin) inhibitors. J Med Chem51:2279-90 (2008) 
 
RmtA
Name:RmtA
Synonyms:n/a
Type:PROTEIN
Mol. Mass.:39351.26
Organism:Emericella nidulans
Description:ChEMBL_475539
Residue:345
BDBM50376168
NameBDBM50376168
Synonyms:EOSIN
TypeSmall organic molecule
Emp. Form.C20H8Br4O5
Mol. Mass.647.891
SMILESOc1c(Br)cc2c(Oc3c(Br)c(O)c(Br)cc3C22OC(=O)c3ccccc23)c1Br