Reaction Details
TargetAndrogen receptor
LigandBDBM82475
Substrate/Competitorn/a
Meas. Tech.ChEMBL_475671 (CHEMBL937557)
Ki 800±n/a nM
Citation Bisson, WHCheltsov, AVBruey-Sedano, NLin, BChen, JGoldberger, NMay, LTChristopoulos, ADalton, JTSexton, PMZhang, XKAbagyan, R Discovery of antiandrogen activity of nonsteroidal scaffolds of marketed drugs. Proc Natl Acad Sci U S A104:11927-32 (2007) 
 
Androgen receptor
Name:Androgen receptor
Type:Enzyme
Mol. Mass.:98219.08
Organism:Rattus norvegicus (Rat)
Description:P15207
Residue:902
BDBM82475
NameBDBM82475
Synonyms:ACETOPHENAZINE NSC_17676 | med.21724, Compound 191
TypeSmall organic molecule
Emp. Form.C23H29N3O2S
Mol. Mass.411.56
SMILESCC(=O)c1ccc2Sc3ccccc3N(CCCN3CCN(CCO)CC3)c2c1