Reaction Details
TargetMitogen-activated protein kinase 14
LigandBDBM50376226
Substrate/Competitorn/a
Meas. Tech.ChEMBL_475725 (CHEMBL934611)
Ki 0.200000±n/a nM
Citation Das, JMoquin, RVPitt, SZhang, RShen, DRMcIntyre, KWGillooly, KDoweyko, AMSack, JSZhang, HKiefer, SEKish, KMcKinnon, MBarrish, JCDodd, JHSchieven, GLLeftheris, K Pyrazolo-pyrimidines: a novel heterocyclic scaffold for potent and selective p38 alpha inhibitors. Bioorg Med Chem Lett18:2652-7 (2008) 
 
Mitogen-activated protein kinase 14
Name:Mitogen-activated protein kinase 14
Type:Serine/threonine-protein kinase
Mol. Mass.:41286.76
Organism:Homo sapiens (Human)
Description:Q16539
Residue:360
BDBM50376226
NameBDBM50376226
Synonyms:CHEMBL259922
TypeSmall organic molecule
Emp. Form.C22H17N7O2
Mol. Mass.411.4161
SMILESCc1ccc(cc1Nc1ncnc2n(ncc12)-c1ccccc1)C(=O)Nc1ccon1