Reaction Details
TargetTransient receptor potential cation channel subfamily V member 1
LigandBDBM50376256
Substrate/Competitorn/a
Meas. Tech.ChEMBL_475763 (CHEMBL930279)
Ki 15±n/a nM
Citation Jetter, MCMcNally, JJYoungman, MAMcDonnell, MEDubin, AENasser, NZhang, SPCodd, EEColburn, RWStone, DRBrandt, MRFlores, CMDax, SL N-pyridin-3-yl- and N-quinolin-3-yl-benzamides: modulators of human vanilloid receptor 1 (TRPV1). Bioorg Med Chem Lett18:2730-4 (2008) 
 
Transient receptor potential cation channel subfamily V member 1
Name:Transient receptor potential cation channel subfamily V member 1
Type:Protein
Mol. Mass.:94960.75
Organism:Homo sapiens (Human)
Description:Q8NER1
Residue:839
BDBM50376256
NameBDBM50376256
Synonyms:CHEMBL259017
TypeSmall organic molecule
Emp. Form.C25H31N3O
Mol. Mass.389.5331
SMILESCCCCCCCCN(C)c1ccc(cc1)C(=O)Nc1cnc2ccccc2c1