Reaction Details
TargetTransient receptor potential cation channel subfamily V member 1
LigandBDBM50376273
Substrate/Competitorn/a
Meas. Tech.ChEMBL_475763 (CHEMBL930279)
Ki 24±n/a nM
Citation Jetter, MCMcNally, JJYoungman, MAMcDonnell, MEDubin, AENasser, NZhang, SPCodd, EEColburn, RWStone, DRBrandt, MRFlores, CMDax, SL N-pyridin-3-yl- and N-quinolin-3-yl-benzamides: modulators of human vanilloid receptor 1 (TRPV1). Bioorg Med Chem Lett18:2730-4 (2008) 
 
Transient receptor potential cation channel subfamily V member 1
Name:Transient receptor potential cation channel subfamily V member 1
Type:Protein
Mol. Mass.:94960.75
Organism:Homo sapiens (Human)
Description:Q8NER1
Residue:839
BDBM50376273
NameBDBM50376273
Synonyms:CHEMBL261766
TypeSmall organic molecule
Emp. Form.C24H29N3O
Mol. Mass.375.5066
SMILESCCCCCCCN(C)c1ccc(cc1)C(=O)Nc1cnc2ccccc2c1