Reaction Details
TargetCarbonic anhydrase 5A, mitochondrial
LigandBDBM10880
Substrate/Competitorn/a
Meas. Tech.ChEMBL_475788 (CHEMBL935613)
Ki 63±n/a nM
Citation Di Fiore, APedone, CAntel, JWaldeck, HWitte, AWurl, MScozzafava, ASupuran, CTDe Simone, G Carbonic anhydrase inhibitors: the X-ray crystal structure of ethoxzolamide complexed to human isoform II reveals the importance of thr200 and gln92 for obtaining tight-binding inhibitors. Bioorg Med Chem Lett18:2669-74 (2008) 
 
Carbonic anhydrase 5A, mitochondrial
Name:Carbonic anhydrase 5A, mitochondrial
Type:Enzyme
Mol. Mass.:34755.54
Organism:Homo sapiens (Human)
Description:Human (cloned) isozyme
Residue:305
BDBM10880
NameBDBM10880
Synonyms:AZA AZM acetazolamide Acetazolamide Acetazolamide (AZA) Acetazolamide, 5 Acetazolamide, AZA CHEMBL20 Sulfonamide, 1 US11278534, Example acetazolamide sulfonamide 1
TypeSmall organic molecule
Emp. Form.C4H6N4O3S2
Mol. Mass.222.245
SMILESCC(=O)Nc1nnc(s1)S(N)(=O)=O