Reaction Details
TargetCarbonic anhydrase 6
LigandBDBM25904
Substrate/Competitorn/a
Meas. Tech.ChEMBL_475790 (CHEMBL935615)
Ki 2650±n/a nM
Citation Di Fiore, APedone, CAntel, JWaldeck, HWitte, AWurl, MScozzafava, ASupuran, CTDe Simone, G Carbonic anhydrase inhibitors: the X-ray crystal structure of ethoxzolamide complexed to human isoform II reveals the importance of thr200 and gln92 for obtaining tight-binding inhibitors. Bioorg Med Chem Lett18:2669-74 (2008) 
 
Carbonic anhydrase 6
Name:Carbonic anhydrase 6
Type:Enzyme
Mol. Mass.:35371.40
Organism:Homo sapiens (Human)
Description:P23280
Residue:308
BDBM25904
NameBDBM25904
Synonyms:2-(hydrazinecarbonyl)-3-phenyl-1H-indole-5-sulfonamide CHEMBL262628 | indole sulfonamide, L
TypeSmall organic molecule
Emp. Form.C15H14N4O3S
Mol. Mass.330.362
SMILESNNC(=O)c1[nH]c2ccc(cc2c1-c1ccccc1)S(N)(=O)=O