Reaction Details
TargetDNA polymerase beta
LigandBDBM23208
Substrate/Competitorn/a
Meas. Tech.ChEMBL_476057 (CHEMBL921745)
IC50 46250±n/a nM
Citation Gao, ZMaloney, DJDedkova, LMHecht, SM Inhibitors of DNA polymerase beta: activity and mechanism. Bioorg Med Chem16:4331-40 (2008) 
 
DNA polymerase beta
Name:DNA polymerase beta
Type:Protein
Mol. Mass.:38188.76
Organism:Homo sapiens (Human)
Description:n/a
Residue:335
BDBM23208
NameBDBM23208
Synonyms:(1R,2R,5S,8R,9R,10R,13R,14R,17S,19R)-17-hydroxy-1,2,14,18,18-pentamethyl-8-(prop-1-en-2-yl)pentacyclo[11.8.0.0^{2,10}.0^{5,9}.0^{14,19}]henicosane-5-carboxylic acid CHEMBL269277 | cid_64971
TypeTerpene
Emp. Form.C30H48O3
Mol. Mass.456.7003
SMILES[H][C@]12[C@@H](CC[C@@]1(CC[C@]1(C)[C@]2([H])CC[C@]2([H])[C@@]3(C)CC[C@H](O)C(C)(C)[C@]3([H])CC[C@@]12C)C(O)=O)C(C)=C