Reaction Details
TargetCarbonic anhydrase 2
LigandBDBM10888
Substrate/Competitorn/a
Meas. Tech.ChEMBL_476221 (CHEMBL935807)
Ki 6800±n/a nM
Citation Maryanoff, BEMcComsey, DFLee, JSmith-Swintosky, VLWang, YMinor, LKTodd, MJ Carbonic anhydrase-II inhibition. what are the true enzyme-inhibitory properties of the sulfamide cognate of topiramate? J Med Chem51:2518-21 (2008) 
 
Carbonic anhydrase 2
Name:Carbonic anhydrase 2
Type:Enzyme
Mol. Mass.:29250.71
Organism:Homo sapiens (Human)
Description:P00918
Residue:260
BDBM10888
NameBDBM10888
Synonyms:1,2-benzoxazol-3-ylmethanesulfonamide SPR_2 Zonisamide Zonisamide (ZNS) Zonisamide, ZNS
TypeSmall organic molecule
Emp. Form.C8H8N2O3S
Mol. Mass.212.226
SMILESNS(=O)(=O)Cc1noc2ccccc12