Reaction Details
TargetIntegrin alpha-V/beta-3
LigandBDBM50376404
Substrate/Competitorn/a
Meas. Tech.ChEMBL_476241 (CHEMBL933518)
IC50 2150±n/a nM
Citation Salvati, MCordero, FMPisaneschi, FMelani, FGratteri, PCini, NBottoncetti, ABrandi, A Synthesis, SAR and in vitro evaluation of new cyclic Arg-Gly-Asp pseudopentapeptides containing a s-cis peptide bond as integrin alphavbeta3 and alphavbeta5 ligands. Bioorg Med Chem16:4262-71 (2008) 
 
Integrin alpha-V/beta-3
Name:Integrin alpha-V/beta-3
Type:Enzyme
Mol. Mass.:n/a
Description:n/a
Components:This complex has 2 components.
Component 1
Name:Integrin alpha-V
Synonyms:ITAV_HUMAN Integrin alpha-V/alpha-5 VNRA Vitronectin receptor | Vitronectin receptor subunit alpha
Type:PROTEIN
Mol. Mass.:116024.92
Organism:Homo sapiens (Human)
Description:ChEMBL_582336
Residue:1048
Component 2
Name:Integrin beta-3
Synonyms:CD_antigen=CD61 GPIIIa ITGB3 Platelet membrane glycoprotein IIIa
Type:Protein
Mol. Mass.:87038.91
Organism:Homo sapiens (Human)
Description:P05106
Residue:788
BDBM50376404
NameBDBM50376404
Synonyms:CHEMBL265445
TypeSmall organic molecule
Emp. Form.C20H30N8O7
Mol. Mass.494.5016
SMILES[#7]\[#6](-[#7])=[#7]\[#6]-[#6]-[#6]-[#6@@H]-1-[#7]-[#6](=O)[C@]23[#6]-[#6]-[#6]-[#7]2-[#6](=O)-[#6@@H](-[#6]3)-[#7]-[#6](=O)-[#6@H](-[#6]-[#6](-[#8])=O)-[#7]-[#6](=O)-[#6]-[#7]-[#6]-1=O