Reaction Details
TargetIntegrin alpha-V/beta-3
LigandBDBM50235980
Substrate/Competitorn/a
Meas. Tech.ChEMBL_476241 (CHEMBL933518)
IC50 18.9±n/a nM
Citation Salvati, MCordero, FMPisaneschi, FMelani, FGratteri, PCini, NBottoncetti, ABrandi, A Synthesis, SAR and in vitro evaluation of new cyclic Arg-Gly-Asp pseudopentapeptides containing a s-cis peptide bond as integrin alphavbeta3 and alphavbeta5 ligands. Bioorg Med Chem16:4262-71 (2008) 
 
Integrin alpha-V/beta-3
Name:Integrin alpha-V/beta-3
Type:Enzyme
Mol. Mass.:n/a
Description:n/a
Components:This complex has 2 components.
Component 1
Name:Integrin alpha-V
Synonyms:ITAV_HUMAN Integrin alpha-V/alpha-5 VNRA Vitronectin receptor | Vitronectin receptor subunit alpha
Type:PROTEIN
Mol. Mass.:116024.92
Organism:Homo sapiens (Human)
Description:ChEMBL_582336
Residue:1048
Component 2
Name:Integrin beta-3
Synonyms:CD_antigen=CD61 GPIIIa ITGB3 Platelet membrane glycoprotein IIIa
Type:Protein
Mol. Mass.:87038.91
Organism:Homo sapiens (Human)
Description:P05106
Residue:788
BDBM50235980
NameBDBM50235980
Synonyms:2-((2S,5R,8S,11S)-5-benzyl-11-(3-guanidinopropyl)-8-isopropyl-7-methyl-3,6,9,12,15-pentaoxo-1,4,7,10,13-pentaazacyclopentadecan-2-yl)acetic acid CILENGITIDE EMD-121974 c(RGDfMeV) | cyclo(Arg-Gly-Asp-D-Phe-[N-Me]Val)
TypeSmall organic molecule
Emp. Form.C27H40N8O7
Mol. Mass.588.6559
SMILES[#6]-[#6](-[#6])-[#6@@H]-1-[#7](-[#6])-[#6](=O)-[#6@@H](-[#6]-c2ccccc2)-[#7]-[#6](=O)-[#6@H](-[#6]-[#6](-[#8])=O)-[#7]-[#6](=O)-[#6]-[#7]-[#6](=O)-[#6@H](-[#6]-[#6]-[#6]\[#7]=[#6](\[#7])-[#7])-[#7]-[#6]-1=O