Reaction Details
TargetMitogen-activated protein kinase 14
LigandBDBM50376455
Substrate/Competitorn/a
Meas. Tech.ChEMBL_476693 (CHEMBL933483)
IC50 1±n/a nM
Citation Wrobleski, STLin, SHynes, JWu, HPitt, SShen, DRZhang, RGillooly, KMShuster, DJMcIntyre, KWDoweyko, AMKish, KFTredup, JADuke, GJSack, JSMcKinnon, MDodd, JBarrish, JCSchieven, GLLeftheris, K Synthesis and SAR of new pyrrolo[2,1-f][1,2,4]triazines as potent p38 alpha MAP kinase inhibitors. Bioorg Med Chem Lett18:2739-44 (2008) 
 
Mitogen-activated protein kinase 14
Name:Mitogen-activated protein kinase 14
Type:Serine/threonine-protein kinase
Mol. Mass.:41286.76
Organism:Homo sapiens (Human)
Description:Q16539
Residue:360
BDBM50376455
NameBDBM50376455
Synonyms:CHEMBL261007
TypeSmall organic molecule
Emp. Form.C26H25FN6O4
Mol. Mass.504.5129
SMILESCc1c(cn2ncnc(Nc3cc(NC(=O)c4cc(F)cc(c4)N4CCOCC4)ccc3C)c12)C(O)=O