Reaction Details
TargetCAAX prenyl protease 1 homolog
LigandBDBM578
Substrate/Competitorn/a
Meas. Tech.ChEMBL_476919 (CHEMBL924570)
IC50 18400±n/a nM
Citation Coffinier, CHudon, SEFarber, EAChang, SYHrycyna, CAYoung, SGFong, LG HIV protease inhibitors block the zinc metalloproteinase ZMPSTE24 and lead to an accumulation of prelamin A in cells. Proc Natl Acad Sci U S A104:13432-7 (2007) 
 
CAAX prenyl protease 1 homolog
Name:CAAX prenyl protease 1 homolog
Type:PROTEIN
Mol. Mass.:54735.85
Organism:Mus musculus
Description:ChEMBL_476919
Residue:475
BDBM578
NameBDBM578
Synonyms:(2S)-N-[(2S,4S,5S)-5-[2-(2,6-dimethylphenoxy)acetamido]-4-hydroxy-1,6-diphenylhexan-2-yl]-3-methyl-2-(2-oxo-1,3-diazinan-1-yl)butanamide Aluviran LPV | Lopinavir
TypeSmall organic molecule
Emp. Form.C37H48N4O5
Mol. Mass.628.8008
SMILESCC(C)[C@H](N1CCCNC1=O)C(=O)N[C@H](C[C@H](O)[C@H](Cc1ccccc1)NC(=O)COc1c(C)cccc1C)Cc1ccccc1