Reaction Details
TargetMetabotropic glutamate receptor 2
LigandBDBM50376467
Substrate/Competitorn/a
Meas. Tech.ChEMBL_476982 (CHEMBL937487)
IC50 11±n/a nM
Citation Woltering, TJWichmann, JGoetschi, EAdam, GKew, JNKnoflach, FBallard, TMHuwyler, JMutel, VGatti, S Synthesis and characterization of 1,3-dihydro-benzo[b][1,4]diazepin-2-one derivatives: Part 3. New potent non-competitive metabotropic glutamate receptor 2/3 antagonists. Bioorg Med Chem Lett18:2725-9 (2008) 
 
Metabotropic glutamate receptor 2
Name:Metabotropic glutamate receptor 2
Type:Enzyme
Mol. Mass.:95584.88
Organism:Homo sapiens (Human)
Description:Q14416
Residue:872
BDBM50376467
NameBDBM50376467
Synonyms:CHEMBL260636
TypeSmall organic molecule
Emp. Form.C24H17FN4O
Mol. Mass.396.4164
SMILESFc1ccccc1-c1ccc2N=C(CC(=O)Nc2c1)c1cccc(c1)-n1ccnc1