Reaction Details
TargetMetabotropic glutamate receptor 2
LigandBDBM50332990
Substrate/Competitorn/a
Meas. Tech.ChEMBL_476982 (CHEMBL937487)
IC50 24±n/a nM
Citation Woltering, TJWichmann, JGoetschi, EAdam, GKew, JNKnoflach, FBallard, TMHuwyler, JMutel, VGatti, S Synthesis and characterization of 1,3-dihydro-benzo[b][1,4]diazepin-2-one derivatives: Part 3. New potent non-competitive metabotropic glutamate receptor 2/3 antagonists. Bioorg Med Chem Lett18:2725-9 (2008) 
 
Metabotropic glutamate receptor 2
Name:Metabotropic glutamate receptor 2
Type:Enzyme
Mol. Mass.:95584.88
Organism:Homo sapiens (Human)
Description:Q14416
Residue:872
BDBM50332990
NameBDBM50332990
Synonyms:4-(3-(1H-imidazol-1-yl)phenyl)-8-((4-fluorophenyl)ethynyl)-7-hydroxy-1H-benzo[b][1,4]diazepin-2(3H)-one CHEMBL411440
TypeSmall organic molecule
Emp. Form.C26H17FN4O2
Mol. Mass.436.4372
SMILESOc1cc2N=C(CC(=O)Nc2cc1C#Cc1ccc(F)cc1)c1cccc(c1)-n1ccnc1