Reaction Details
TargetMetabotropic glutamate receptor 2
LigandBDBM50376479
Substrate/Competitorn/a
Meas. Tech.ChEMBL_476980 (CHEMBL937485)
IC50 17±n/a nM
Citation Woltering, TJWichmann, JGoetschi, EAdam, GKew, JNKnoflach, FBallard, TMHuwyler, JMutel, VGatti, S Synthesis and characterization of 1,3-dihydro-benzo[b][1,4]diazepin-2-one derivatives: Part 3. New potent non-competitive metabotropic glutamate receptor 2/3 antagonists. Bioorg Med Chem Lett18:2725-9 (2008) 
 
Metabotropic glutamate receptor 2
Name:Metabotropic glutamate receptor 2
Type:Enzyme
Mol. Mass.:95584.88
Organism:Homo sapiens (Human)
Description:Q14416
Residue:872
BDBM50376479
NameBDBM50376479
Synonyms:CHEMBL261081
TypeSmall organic molecule
Emp. Form.C23H15F2N5O
Mol. Mass.415.3949
SMILESFc1ccc(F)c(c1)-c1ccc2N=C(CC(=O)Nc2c1)c1cccc(c1)-n1ccnn1