Reaction Details
TargetMetabotropic glutamate receptor 2
LigandBDBM50332992
Substrate/Competitorn/a
Meas. Tech.ChEMBL_476980 (CHEMBL937485)
IC50 12±n/a nM
Citation Woltering, TJWichmann, JGoetschi, EAdam, GKew, JNKnoflach, FBallard, TMHuwyler, JMutel, VGatti, S Synthesis and characterization of 1,3-dihydro-benzo[b][1,4]diazepin-2-one derivatives: Part 3. New potent non-competitive metabotropic glutamate receptor 2/3 antagonists. Bioorg Med Chem Lett18:2725-9 (2008) 
 
Metabotropic glutamate receptor 2
Name:Metabotropic glutamate receptor 2
Type:Enzyme
Mol. Mass.:95584.88
Organism:Homo sapiens (Human)
Description:Q14416
Residue:872
BDBM50332992
NameBDBM50332992
Synonyms:4-(3-(1H-imidazol-1-yl)phenyl)-7-methyl-8-(trifluoromethyl)-1H-benzo[b][1,4]diazepin-2(3H)-one | CHEMBL411095
TypeSmall organic molecule
Emp. Form.C20H15F3N4O
Mol. Mass.384.3545
SMILESCc1cc2N=C(CC(=O)Nc2cc1C(F)(F)F)c1cccc(c1)-n1ccnc1