Reaction Details
TargetMetabotropic glutamate receptor 2
LigandBDBM50376489
Substrate/Competitorn/a
Meas. Tech.ChEMBL_476980 (CHEMBL937485)
IC50 42±n/a nM
Citation Woltering, TJWichmann, JGoetschi, EAdam, GKew, JNKnoflach, FBallard, TMHuwyler, JMutel, VGatti, S Synthesis and characterization of 1,3-dihydro-benzo[b][1,4]diazepin-2-one derivatives: Part 3. New potent non-competitive metabotropic glutamate receptor 2/3 antagonists. Bioorg Med Chem Lett18:2725-9 (2008) 
 
Metabotropic glutamate receptor 2
Name:Metabotropic glutamate receptor 2
Type:Enzyme
Mol. Mass.:95584.88
Organism:Homo sapiens (Human)
Description:Q14416
Residue:872
BDBM50376489
NameBDBM50376489
Synonyms:CHEMBL260643
TypeSmall organic molecule
Emp. Form.C22H21F3N6O
Mol. Mass.442.4369
SMILESCC(C)CNc1cc2N=C(CC(=O)Nc2cc1C(F)(F)F)c1cccc(c1)-n1ccnn1