Reaction Details
TargetPotassium voltage-gated channel subfamily H member 2
LigandBDBM50376592
Substrate/Competitorn/a
Meas. Tech.ChEMBL_477490 (CHEMBL937366)
EC50 15000±n/a nM
Citation Perry, MSachse, FBSanguinetti, MC Structural basis of action for a human ether-a-go-go-related gene 1 potassium channel activator. Proc Natl Acad Sci U S A104:13827-32 (2007) 
 
Potassium voltage-gated channel subfamily H member 2
Name:Potassium voltage-gated channel subfamily H member 2
Type:Multi-pass membrane protein
Mol. Mass.:126672.65
Organism:Homo sapiens (Human)
Description:Q12809
Residue:1159
BDBM50376592
NameBDBM50376592
Synonyms:CHEMBL406931
TypeSmall organic molecule
Emp. Form.C28H25F3N2O4
Mol. Mass.510.5043
SMILESCOc1ccc2nccc(C(=O)CC[C@@H]3CCN(CC#Cc4cc(F)cc(F)c4F)C[C@@H]3C(O)=O)c2c1