Reaction Details
TargetCholesteryl ester transfer protein
LigandBDBM50376711
Substrate/Competitorn/a
Meas. Tech.ChEMBL_477677 (CHEMBL924743)
IC50 18±n/a nM
Citation Harikrishnan, LSKamau, MGHerpin, TFMorton, GCLiu, YCooper, CBSalvati, MEQiao, JXWang, TCAdam, LPTaylor, DSChen, AYYin, XSeethala, RPeterson, TLNirschl, DSMiller, AVWeigelt, CAAppiah, KKO'Connell, JCMichael Lawrence, R 2-Arylbenzoxazoles as novel cholesteryl ester transfer protein inhibitors: optimization via array synthesis. Bioorg Med Chem Lett18:2640-4 (2008) 
 
Cholesteryl ester transfer protein
Name:Cholesteryl ester transfer protein
Type:Enzyme
Mol. Mass.:54751.53
Organism:Homo sapiens (Human)
Description:P11597
Residue:493
BDBM50376711
NameBDBM50376711
Synonyms:CHEMBL259503
TypeSmall organic molecule
Emp. Form.C25H18ClN3O5
Mol. Mass.475.881
SMILESCOC(=O)c1c(Cl)ccc(OCC(=O)Nc2ccc(cc2)-c2nc3cc(ccc3o2)C#N)c1C