Reaction Details
TargetCholesteryl ester transfer protein
LigandBDBM50376712
Substrate/Competitorn/a
Meas. Tech.ChEMBL_477677 (CHEMBL924743)
IC50 11±n/a nM
Citation Harikrishnan, LSKamau, MGHerpin, TFMorton, GCLiu, YCooper, CBSalvati, MEQiao, JXWang, TCAdam, LPTaylor, DSChen, AYYin, XSeethala, RPeterson, TLNirschl, DSMiller, AVWeigelt, CAAppiah, KKO'Connell, JCMichael Lawrence, R 2-Arylbenzoxazoles as novel cholesteryl ester transfer protein inhibitors: optimization via array synthesis. Bioorg Med Chem Lett18:2640-4 (2008) 
 
Cholesteryl ester transfer protein
Name:Cholesteryl ester transfer protein
Type:Enzyme
Mol. Mass.:54751.53
Organism:Homo sapiens (Human)
Description:P11597
Residue:493
BDBM50376712
NameBDBM50376712
Synonyms:CHEMBL259502
TypeSmall organic molecule
Emp. Form.C23H16BrN3O3
Mol. Mass.462.295
SMILESCc1cc(Br)ccc1OCC(=O)Nc1ccc(cc1)-c1nc2cc(ccc2o1)C#N