Reaction Details
TargetSolute carrier family 22 member 12
LigandBDBM26658
Substrate/Competitorn/a
Meas. Tech.ChEMBL_477689 (CHEMBL925845)
IC50 2000±n/a nM
Citation Yu, ZFong, WPCheng, CH Morin (3,5,7,2',4'-pentahydroxyflavone) exhibits potent inhibitory actions on urate transport by the human urate anion transporter (hURAT1) expressed in human embryonic kidney cells. Drug Metab Dispos35:981-6 (2007) 
 
Solute carrier family 22 member 12
Name:Solute carrier family 22 member 12
Type:Enzyme
Mol. Mass.:59638.65
Organism:Homo sapiens (Human)
Description:Q96S37
Residue:553
BDBM26658
NameBDBM26658
Synonyms:2-(2,4-dihydroxyphenyl)-3,5,7-trihydroxy-1-benzopyran-4-one 2-(2,4-dihydroxyphenyl)-3,5,7-trihydroxy-chromone 2-[2,4-bis(oxidanyl)phenyl]-3,5,7-tris(oxidanyl)chromen-4-one MLS000069618 Morin (5) SMR000058259 morin
TypeFlavonoid
Emp. Form.C15H10O7
Mol. Mass.302.2357
SMILESOc1ccc(c(O)c1)-c1oc2cc(O)cc(O)c2c(=O)c1O