Reaction Details
TargetPhosphotransferase
LigandBDBM50173799
Substrate/Competitorn/a
Meas. Tech.ChEMBL_477694 (CHEMBL931371)
Ki 600±n/a nM
Citation Sanz-Rodríguez, CEConcepción, JLPekerar, SOldfield, EUrbina, JA Bisphosphonates as inhibitors of Trypanosoma cruzi hexokinase: kinetic and metabolic studies. J Biol Chem282:12377-87 (2007) 
 
Phosphotransferase
Name:Phosphotransferase
Synonyms:Hexokinase
Type:PROTEIN
Mol. Mass.:52180.94
Organism:Trypanosoma cruzi
Description:ChEMBL_330068
Residue:471
BDBM50173799
NameBDBM50173799
TypeSmall organic molecule
Emp. Form.C7H10BrNO6P2
Mol. Mass.346.009
SMILESOP(O)(=O)C(Nc1cccc(Br)c1)P(O)(O)=O