Reaction Details
TargetC5a anaphylatoxin chemotactic receptor 1
LigandBDBM50376789
Substrate/Competitorn/a
Meas. Tech.ChEMBL_477916 (CHEMBL923541)
IC50 820±n/a nM
Citation Barbay, JKGong, YBuntinx, MLi, JClaes, CHornby, PJVan Lommen, GVan Wauwe, JHe, W Synthesis and characterization of 5,6,7,8-tetrahydroquinoline C5a receptor antagonists. Bioorg Med Chem Lett18:2544-8 (2008) 
 
C5a anaphylatoxin chemotactic receptor 1
Name:C5a anaphylatoxin chemotactic receptor 1
Type:Enzyme
Mol. Mass.:39347.68
Organism:Homo sapiens (Human)
Description:P21730
Residue:350
BDBM50376789
NameBDBM50376789
Synonyms:CHEMBL257128
TypeSmall organic molecule
Emp. Form.C30H36N2O
Mol. Mass.440.6196
SMILESCCc1cccc(CC)c1-c1cc(OC)c2C(CCCc2n1)N[C@H]1CCCc2ccccc12