Reaction Details
TargetC5a anaphylatoxin chemotactic receptor 1
LigandBDBM50238586
Substrate/Competitorn/a
Meas. Tech.ChEMBL_477916 (CHEMBL923541)
IC50 7900±n/a nM
Citation Barbay, JKGong, YBuntinx, MLi, JClaes, CHornby, PJVan Lommen, GVan Wauwe, JHe, W Synthesis and characterization of 5,6,7,8-tetrahydroquinoline C5a receptor antagonists. Bioorg Med Chem Lett18:2544-8 (2008) 
 
C5a anaphylatoxin chemotactic receptor 1
Name:C5a anaphylatoxin chemotactic receptor 1
Type:Enzyme
Mol. Mass.:39347.68
Organism:Homo sapiens (Human)
Description:P21730
Residue:350
BDBM50238586
NameBDBM50238586
Synonyms:(+/-)-2-(2,6-diethylphenyl)-4-methoxy-N-methyl-N-phenyl-5,6,7,8-tetrahydroquinolin-5-amine CHEMBL410927
TypeSmall organic molecule
Emp. Form.C27H32N2O
Mol. Mass.400.5558
SMILESCCc1cccc(CC)c1-c1cc(OC)c2C(CCCc2n1)N(C)c1ccccc1