Reaction Details
TargetC5a anaphylatoxin chemotactic receptor 1
LigandBDBM50376803
Substrate/Competitorn/a
Meas. Tech.ChEMBL_477917 (CHEMBL923542)
Ki 9.70±n/a nM
Citation Barbay, JKGong, YBuntinx, MLi, JClaes, CHornby, PJVan Lommen, GVan Wauwe, JHe, W Synthesis and characterization of 5,6,7,8-tetrahydroquinoline C5a receptor antagonists. Bioorg Med Chem Lett18:2544-8 (2008) 
 
C5a anaphylatoxin chemotactic receptor 1
Name:C5a anaphylatoxin chemotactic receptor 1
Type:Enzyme
Mol. Mass.:39347.68
Organism:Homo sapiens (Human)
Description:P21730
Residue:350
BDBM50376803
NameBDBM50376803
Synonyms:CHEMBL262330
TypeSmall organic molecule
Emp. Form.C30H33F3N2O
Mol. Mass.494.591
SMILESCCc1cccc(CC)c1-c1cc(OC)c2C(CCCc2n1)N1CCc2cccc(c2C1)C(F)(F)F