Reaction Details
TargetC5a anaphylatoxin chemotactic receptor 1
LigandBDBM50376831
Substrate/Competitorn/a
Meas. Tech.ChEMBL_477917 (CHEMBL923542)
Ki 180±n/a nM
Citation Barbay, JKGong, YBuntinx, MLi, JClaes, CHornby, PJVan Lommen, GVan Wauwe, JHe, W Synthesis and characterization of 5,6,7,8-tetrahydroquinoline C5a receptor antagonists. Bioorg Med Chem Lett18:2544-8 (2008) 
 
C5a anaphylatoxin chemotactic receptor 1
Name:C5a anaphylatoxin chemotactic receptor 1
Type:Enzyme
Mol. Mass.:39347.68
Organism:Homo sapiens (Human)
Description:P21730
Residue:350
BDBM50376831
NameBDBM50376831
Synonyms:CHEMBL410032
TypeSmall organic molecule
Emp. Form.C31H33ClN2
Mol. Mass.469.06
SMILESCCN(C1CCCc2nc(cc(Cl)c12)-c1c(CC)cccc1CC)c1cccc2ccccc12