Reaction Details
TargetDelta-type opioid receptor
LigandBDBM50376848
Substrate/Competitorn/a
Meas. Tech.ChEMBL_477926 (CHEMBL923551)
Ki>10000±n/a nM
Citation Tidgewell, KGroer, CEHarding, WWLozama, ASchmidt, MMarquam, AHiemstra, JPartilla, JSDersch, CMRothman, RBBohn, LMPrisinzano, TE Herkinorin analogues with differential beta-arrestin-2 interactions. J Med Chem51:2421-31 (2008) 
 
Delta-type opioid receptor
Name:Delta-type opioid receptor
Type:G Protein-Coupled Receptor (GPCR)
Mol. Mass.:40382.98
Organism:Homo sapiens (Human)
Description:Competition binding assays were carried out using membrane preparations from transfected HN9.10 cells that constitutively expressed the delta opioid receptor.
Residue:372
BDBM50376848
NameBDBM50376848
Synonyms:CHEMBL265195
TypeSmall organic molecule
Emp. Form.C28H29NO10
Mol. Mass.539.5306
SMILESCOC(=O)[C@@H]1C[C@H](OC(=O)c2ccc(cc2)[N+]([O-])=O)C(=O)[C@H]2[C@@]1(C)CC[C@H]1C(=O)O[C@@H](C[C@]21C)c1ccoc1