Reaction Details
TargetMu-type opioid receptor
LigandBDBM50238620
Substrate/Competitorn/a
Meas. Tech.ChEMBL_477925 (CHEMBL923550)
Ki 10±n/a nM
Citation Tidgewell, KGroer, CEHarding, WWLozama, ASchmidt, MMarquam, AHiemstra, JPartilla, JSDersch, CMRothman, RBBohn, LMPrisinzano, TE Herkinorin analogues with differential beta-arrestin-2 interactions. J Med Chem51:2421-31 (2008) 
 
Mu-type opioid receptor
Name:Mu-type opioid receptor
Type:G Protein-Coupled Receptor (GPCR)
Mol. Mass.:44789.51
Organism:Homo sapiens (Human)
Description:P35372
Residue:400
BDBM50238620
NameBDBM50238620
Synonyms:(2S,4aR,6aR,7R,9S,10aS,10bR)-9-(4-Bromobenzoyloxy)-2-(3-furanyl)-dodecahydro-6a,10b-dimethyl-4,10-dioxo-2H-naphtho-[2,1-c]pyran-7-carboxylic Acid Methyl Ester CHEMBL259299
TypeSmall organic molecule
Emp. Form.C28H29BrO8
Mol. Mass.573.429
SMILESCOC(=O)[C@@H]1C[C@H](OC(=O)c2ccc(Br)cc2)C(=O)[C@H]2[C@@]1(C)CC[C@H]1C(=O)O[C@@H](C[C@]21C)c1ccoc1