Reaction Details
TargetKappa-type opioid receptor
LigandBDBM50376842
Substrate/Competitorn/a
Meas. Tech.ChEMBL_477932 (CHEMBL935623)
EC50 840±n/a nM
Citation Tidgewell, KGroer, CEHarding, WWLozama, ASchmidt, MMarquam, AHiemstra, JPartilla, JSDersch, CMRothman, RBBohn, LMPrisinzano, TE Herkinorin analogues with differential beta-arrestin-2 interactions. J Med Chem51:2421-31 (2008) 
 
Kappa-type opioid receptor
Name:Kappa-type opioid receptor
Type:G Protein-Coupled Receptor (GPCR)
Mol. Mass.:42648.76
Organism:Homo sapiens (Human)
Description:P41145
Residue:380
BDBM50376842
NameBDBM50376842
Synonyms:CHEMBL410436
TypeSmall organic molecule
Emp. Form.C26H28O8S
Mol. Mass.500.561
SMILESCOC(=O)[C@@H]1C[C@H](OC(=O)c2ccsc2)C(=O)[C@H]2[C@@]1(C)CC[C@H]1C(=O)O[C@@H](C[C@]21C)c1ccoc1