Reaction Details
TargetKappa-type opioid receptor
LigandBDBM50000296
Substrate/Competitorn/a
Meas. Tech.ChEMBL_477932 (CHEMBL935623)
EC50 30±n/a nM
Citation Tidgewell, KGroer, CEHarding, WWLozama, ASchmidt, MMarquam, AHiemstra, JPartilla, JSDersch, CMRothman, RBBohn, LMPrisinzano, TE Herkinorin analogues with differential beta-arrestin-2 interactions. J Med Chem51:2421-31 (2008) 
 
Kappa-type opioid receptor
Name:Kappa-type opioid receptor
Type:G Protein-Coupled Receptor (GPCR)
Mol. Mass.:42648.76
Organism:Homo sapiens (Human)
Description:P41145
Residue:380
BDBM50000296
NameBDBM50000296
Synonyms:CHEMBL441765 U-50488H | US11492374, ID 1
TypeSmall organic molecule
Emp. Form.C19H26Cl2N2O
Mol. Mass.369.329
SMILESCN([C@@H]1CCCC[C@H]1N1CCCC1)C(=O)Cc1ccc(Cl)c(Cl)c1