Reaction Details
TargetMu-type opioid receptor
LigandBDBM50376850
Substrate/Competitorn/a
Meas. Tech.ChEMBL_477925 (CHEMBL923550)
Ki 1030±n/a nM
Citation Tidgewell, KGroer, CEHarding, WWLozama, ASchmidt, MMarquam, AHiemstra, JPartilla, JSDersch, CMRothman, RBBohn, LMPrisinzano, TE Herkinorin analogues with differential beta-arrestin-2 interactions. J Med Chem51:2421-31 (2008) 
 
Mu-type opioid receptor
Name:Mu-type opioid receptor
Type:G Protein-Coupled Receptor (GPCR)
Mol. Mass.:44789.51
Organism:Homo sapiens (Human)
Description:P35372
Residue:400
BDBM50376850
NameBDBM50376850
Synonyms:CHEMBL258754
TypeSmall organic molecule
Emp. Form.C28H36O8
Mol. Mass.500.5806
SMILESCOC(=O)[C@@H]1C[C@H](OC(=O)C2CCCCC2)C(=O)[C@H]2[C@@]1(C)CC[C@H]1C(=O)O[C@@H](C[C@]21C)c1ccoc1