Reaction Details
TargetAurora kinase B
LigandBDBM31093
Substrate/Competitorn/a
Meas. Tech.ChEMBL_477987 (CHEMBL922655)
IC50 5700±n/a nM
Citation Manfredi, MGEcsedy, JAMeetze, KABalani, SKBurenkova, OChen, WGalvin, KMHoar, KMHuck, JJLeRoy, PJRay, ETSells, TBStringer, BStroud, SGVos, TJWeatherhead, GSWysong, DRZhang, MBolen, JBClaiborne, CF Antitumor activity of MLN8054, an orally active small-molecule inhibitor of Aurora A kinase. Proc Natl Acad Sci U S A104:4106-11 (2007) 
 
Aurora kinase B
Name:Aurora kinase B
Type:Protein
Mol. Mass.:39327.72
Organism:Homo sapiens (Human)
Description:Q96GD4
Residue:344
BDBM31093
NameBDBM31093
Synonyms:4-[[7-[2,6-bis(fluoranyl)phenyl]-9-chloranyl-5H-pyrimido[5,4-d][2]benzazepin-2-yl]amino]benzoic acid BDBM31832 MLN-8054 | cid_11712649
TypeSmall organic molecule
Emp. Form.C25H15ClF2N4O2
Mol. Mass.476.862
SMILESOC(=O)c1ccc(Nc2ncc3CN=C(c4cc(Cl)ccc4-c3n2)c2c(F)cccc2F)cc1