Reaction Details
TargetProstaglandin G/H synthase 2
LigandBDBM50376853
Substrate/Competitorn/a
Meas. Tech.ChEMBL_478523 (CHEMBL923485)
IC50 1400±n/a nM
Citation Reddy, MVBilla, VKPallela, VRMallireddigari, MRBoominathan, RGabriel, JLReddy, EP Design, synthesis, and biological evaluation of 1-(4-sulfamylphenyl)-3-trifluoromethyl-5-indolyl pyrazolines as cyclooxygenase-2 (COX-2) and lipoxygenase (LOX) inhibitors. Bioorg Med Chem16:3907-16 (2008) 
 
Prostaglandin G/H synthase 2
Name:Prostaglandin G/H synthase 2
Type:Protein
Mol. Mass.:68976.98
Organism:Ovis aries (Sheep)
Description:n/a
Residue:603
BDBM50376853
NameBDBM50376853
Synonyms:CHEMBL258986
TypeSmall organic molecule
Emp. Form.C18H15F3N4O2S
Mol. Mass.408.398
SMILESNS(=O)(=O)c1ccc(cc1)N1N=C(CC1c1c[nH]c2ccccc12)C(F)(F)F