Reaction Details
TargetProstaglandin G/H synthase 2
LigandBDBM50376865
Substrate/Competitorn/a
Meas. Tech.ChEMBL_478523 (CHEMBL923485)
IC50 850±n/a nM
Citation Reddy, MVBilla, VKPallela, VRMallireddigari, MRBoominathan, RGabriel, JLReddy, EP Design, synthesis, and biological evaluation of 1-(4-sulfamylphenyl)-3-trifluoromethyl-5-indolyl pyrazolines as cyclooxygenase-2 (COX-2) and lipoxygenase (LOX) inhibitors. Bioorg Med Chem16:3907-16 (2008) 
 
Prostaglandin G/H synthase 2
Name:Prostaglandin G/H synthase 2
Type:Protein
Mol. Mass.:68976.98
Organism:Ovis aries (Sheep)
Description:n/a
Residue:603
BDBM50376865
NameBDBM50376865
Synonyms:CHEMBL412100
TypeSmall organic molecule
Emp. Form.C18H16F3N5O2S
Mol. Mass.423.412
SMILESNc1ccc2[nH]cc(C3CC(=NN3c3ccc(cc3)S(N)(=O)=O)C(F)(F)F)c2c1