Reaction Details
TargetInduced myeloid leukemia cell differentiation protein Mcl-1
LigandBDBM50376902
Substrate/Competitorn/a
Meas. Tech.ChEMBL_478761 (CHEMBL936497)
Ki 1000±n/a nM
Citation Nguyen, MMarcellus, RCRoulston, AWatson, MSerfass, LMurthy Madiraju, SRGoulet, DViallet, JBélec, LBillot, XAcoca, SPurisima, EWiegmans, ACluse, LJohnstone, RWBeauparlant, PShore, GC Small molecule obatoclax (GX15-070) antagonizes MCL-1 and overcomes MCL-1-mediated resistance to apoptosis. Proc Natl Acad Sci U S A104:19512-7 (2007) 
 
Induced myeloid leukemia cell differentiation protein Mcl-1
Name:Induced myeloid leukemia cell differentiation protein Mcl-1
Type:Membrane; Single-pass membrane protein
Mol. Mass.:37332.87
Organism:Homo sapiens (Human)
Description:Q07820
Residue:350
BDBM50376902
NameBDBM50376902
Synonyms:CHEMBL408194
TypeSmall organic molecule
Emp. Form.C20H19N3O
Mol. Mass.317.3844
SMILESCOC1=CC(=N\C1=C/c1[nH]c(C)cc1C)c1cc2ccccc2[nH]1