Reaction Details
TargetBcl-2-related protein A1
LigandBDBM50376902
Substrate/Competitorn/a
Meas. Tech.ChEMBL_478763 (CHEMBL936499)
Ki 1000±n/a nM
Citation Nguyen, MMarcellus, RCRoulston, AWatson, MSerfass, LMurthy Madiraju, SRGoulet, DViallet, JBélec, LBillot, XAcoca, SPurisima, EWiegmans, ACluse, LJohnstone, RWBeauparlant, PShore, GC Small molecule obatoclax (GX15-070) antagonizes MCL-1 and overcomes MCL-1-mediated resistance to apoptosis. Proc Natl Acad Sci U S A104:19512-7 (2007) 
 
Bcl-2-related protein A1
Name:Bcl-2-related protein A1
Type:Apoptosis regulator protein
Mol. Mass.:20130.01
Organism:Homo sapiens (Human)
Description:n/a
Residue:175
BDBM50376902
NameBDBM50376902
Synonyms:CHEMBL408194
TypeSmall organic molecule
Emp. Form.C20H19N3O
Mol. Mass.317.3844
SMILESCOC1=CC(=N\C1=C/c1[nH]c(C)cc1C)c1cc2ccccc2[nH]1