Reaction Details
TargetEquilibrative nucleoside transporter 1
LigandBDBM50375654
Substrate/Competitorn/a
Meas. Tech.ChEMBL_478938 (CHEMBL936364)
IC50 229086.77±n/a nM
Citation Zhu, ZBuolamwini, JK Constrained NBMPR analogue synthesis, pharmacophore mapping and 3D-QSAR modeling of equilibrative nucleoside transporter 1 (ENT1) inhibitory activity. Bioorg Med Chem16:3848-65 (2008) 
 
Equilibrative nucleoside transporter 1
Name:Equilibrative nucleoside transporter 1
Type:Multi-pass membrane protein
Mol. Mass.:50225.92
Organism:Homo sapiens (Human)
Description:n/a
Residue:456
BDBM50375654
NameBDBM50375654
Synonyms:CHEMBL99203 | US11633415, Compound 5-iodotubercidin
TypeSmall organic molecule
Emp. Form.C11H13IN4O4
Mol. Mass.392.1498
SMILESNc1ncnc2n(cc(I)c12)[C@@H]1O[C@H](CO)[C@@H](O)[C@H]1O