Reaction Details
TargetDelta-type opioid receptor
LigandBDBM50377011
Substrate/Competitorn/a
Meas. Tech.ChEMBL_479226 (CHEMBL927002)
Ki 6.2±n/a nM
Citation Kumar, VGuo, DMarella, MCassel, JADehaven, RNDaubert, JDMansson, E Use of receptor chimeras to identify small molecules with high affinity for the dynorphin A binding domain of the kappa opioid receptor. Bioorg Med Chem Lett18:3667-71 (2008) 
 
Delta-type opioid receptor
Name:Delta-type opioid receptor
Type:G Protein-Coupled Receptor (GPCR)
Mol. Mass.:40382.98
Organism:Homo sapiens (Human)
Description:Competition binding assays were carried out using membrane preparations from transfected HN9.10 cells that constitutively expressed the delta opioid receptor.
Residue:372
BDBM50377011
NameBDBM50377011
Synonyms:CHEMBL257139
TypeSmall organic molecule
Emp. Form.C24H31N3O6S
Mol. Mass.489.584
SMILESCN(C)S(=O)(=O)c1cc2OCOc2cc1CC(=O)N(C)[C@H](CN1CC[C@H](O)C1)c1ccccc1