Reaction Details
TargetMu-type opioid receptor
LigandBDBM50007344
Substrate/Competitorn/a
Meas. Tech.ChEMBL_479225 (CHEMBL927003)
Ki 53±n/a nM
Citation Kumar, VGuo, DMarella, MCassel, JADehaven, RNDaubert, JDMansson, E Use of receptor chimeras to identify small molecules with high affinity for the dynorphin A binding domain of the kappa opioid receptor. Bioorg Med Chem Lett18:3667-71 (2008) 
 
Mu-type opioid receptor
Name:Mu-type opioid receptor
Type:G Protein-Coupled Receptor (GPCR)
Mol. Mass.:44789.51
Organism:Homo sapiens (Human)
Description:P35372
Residue:400
BDBM50007344
NameBDBM50007344
Synonyms:(S)-2-(3,4-Dichloro-phenyl)-N-methyl-N-(1-phenyl-2-pyrrolidin-1-yl-ethyl)-acetamide(ICI 199441) 2-(3,4-Dichloro-phenyl)-N-methyl-N-((S)-1-phenyl-2-pyrrolidin-1-yl-ethyl)-acetamide CHEMBL38576 | ICI-199441
TypeSmall organic molecule
Emp. Form.C21H24Cl2N2O
Mol. Mass.391.334
SMILESCN([C@H](CN1CCCC1)c1ccccc1)C(=O)Cc1ccc(Cl)c(Cl)c1