Reaction Details
TargetKappa-type opioid receptor
LigandBDBM50377007
Substrate/Competitorn/a
Meas. Tech.ChEMBL_479227 (CHEMBL927001)
EC50 0.120000±n/a nM
Citation Kumar, VGuo, DMarella, MCassel, JADehaven, RNDaubert, JDMansson, E Use of receptor chimeras to identify small molecules with high affinity for the dynorphin A binding domain of the kappa opioid receptor. Bioorg Med Chem Lett18:3667-71 (2008) 
 
Kappa-type opioid receptor
Name:Kappa-type opioid receptor
Type:G Protein-Coupled Receptor (GPCR)
Mol. Mass.:42648.76
Organism:Homo sapiens (Human)
Description:P41145
Residue:380
BDBM50377007
NameBDBM50377007
Synonyms:CHEMBL257355
TypeSmall organic molecule
Emp. Form.C27H37N3O6S
Mol. Mass.531.664
SMILESCOc1cc(CC(=O)N(C)[C@H](CN2CC[C@H](O)C2)c2ccccc2)c(cc1OC)S(=O)(=O)N1CCCC1