Reaction Details
TargetMu-type opioid receptor
LigandBDBM50377004
Substrate/Competitorn/a
Meas. Tech.ChEMBL_479225 (CHEMBL927003)
Ki>1000±n/a nM
Citation Kumar, VGuo, DMarella, MCassel, JADehaven, RNDaubert, JDMansson, E Use of receptor chimeras to identify small molecules with high affinity for the dynorphin A binding domain of the kappa opioid receptor. Bioorg Med Chem Lett18:3667-71 (2008) 
 
Mu-type opioid receptor
Name:Mu-type opioid receptor
Type:G Protein-Coupled Receptor (GPCR)
Mol. Mass.:44789.51
Organism:Homo sapiens (Human)
Description:P35372
Residue:400
BDBM50377004
NameBDBM50377004
Synonyms:CHEMBL258172
TypeSmall organic molecule
Emp. Form.C23H30N2O3
Mol. Mass.382.4959
SMILESCOc1ccc(CC(=O)N(C)[C@H](CN2CCCC2)c2ccccc2)cc1OC