Reaction Details
TargetKappa-type opioid receptor
LigandBDBM50377017
Substrate/Competitorn/a
Meas. Tech.ChEMBL_479227 (CHEMBL927001)
EC50 0.540000±n/a nM
Citation Kumar, VGuo, DMarella, MCassel, JADehaven, RNDaubert, JDMansson, E Use of receptor chimeras to identify small molecules with high affinity for the dynorphin A binding domain of the kappa opioid receptor. Bioorg Med Chem Lett18:3667-71 (2008) 
 
Kappa-type opioid receptor
Name:Kappa-type opioid receptor
Type:G Protein-Coupled Receptor (GPCR)
Mol. Mass.:42648.76
Organism:Homo sapiens (Human)
Description:P41145
Residue:380
BDBM50377017
NameBDBM50377017
Synonyms:CHEMBL401594
TypeSmall organic molecule
Emp. Form.C31H39N3O5S
Mol. Mass.565.723
SMILESCOc1cc(CC(=O)N(C)[C@H](CN2CCCC2)c2ccccc2)c(cc1OC)S(=O)(=O)N(C)Cc1ccccc1